查看: 586|回复: 2

TinkerBoard2S 编译BuildRoot时无法下载dropbear

[复制链接]

1

主题

3

帖子

11

积分

新手上路

Rank: 1

积分
11
发表于 2022-8-5 14:40:12 | 显示全部楼层 |阅读模式
  1. >>> dropbear 2019.78 Downloading
  2. --2022-08-05 14:33:44--  https://matt.ucc.asn.au/dropbear/releases/dropbear-2019.78.tar.bz2
  3. 正在解析主机 matt.ucc.asn.au (matt.ucc.asn.au)... 172.67.72.143, 104.26.9.126, 104.26.8.126, ...
  4. 正在连接 matt.ucc.asn.au (matt.ucc.asn.au)|172.67.72.143|:443... 已连接。
  5. 已发出 HTTP 请求,正在等待回应... 302 Found
  6. 位置:https://matt.ucc.asn.au/dropbear/releases/dropbear-2019.78.tar.bz2 [跟随至新的 URL]
  7. --2022-08-05 14:33:45--  https://matt.ucc.asn.au/dropbear/releases/dropbear-2019.78.tar.bz2
  8. 再次使用存在的到 matt.ucc.asn.au:443 的连接。
  9. 已发出 HTTP 请求,正在等待回应... 302 Found
  10. 位置:https://matt.ucc.asn.au/dropbear/releases/dropbear-2019.78.tar.bz2 [跟随至新的 URL]
  11. --2022-08-05 14:33:46--  https://matt.ucc.asn.au/dropbear/releases/dropbear-2019.78.tar.bz2
  12. 再次使用存在的到 matt.ucc.asn.au:443 的连接。
  13. 已发出 HTTP 请求,正在等待回应... 302 Found
  14. 位置:https://matt.ucc.asn.au/dropbear/releases/dropbear-2019.78.tar.bz2 [跟随至新的 URL]
  15. --2022-08-05 14:33:46--  https://matt.ucc.asn.au/dropbear/releases/dropbear-2019.78.tar.bz2
  16. 再次使用存在的到 matt.ucc.asn.au:443 的连接。
  17. 已发出 HTTP 请求,正在等待回应... 302 Found
  18. 位置:https://matt.ucc.asn.au/dropbear/releases/dropbear-2019.78.tar.bz2 [跟随至新的 URL]
  19. --2022-08-05 14:33:47--  https://matt.ucc.asn.au/dropbear/releases/dropbear-2019.78.tar.bz2
  20. 再次使用存在的到 matt.ucc.asn.au:443 的连接。
  21. 已发出 HTTP 请求,正在等待回应... 302 Found
  22. 位置:https://matt.ucc.asn.au/dropbear/releases/dropbear-2019.78.tar.bz2 [跟随至新的 URL]
  23. --2022-08-05 14:33:47--  https://matt.ucc.asn.au/dropbear/releases/dropbear-2019.78.tar.bz2
  24. 再次使用存在的到 matt.ucc.asn.au:443 的连接。
  25. 已发出 HTTP 请求,正在等待回应... 302 Found
  26. 位置:https://matt.ucc.asn.au/dropbear/releases/dropbear-2019.78.tar.bz2 [跟随至新的 URL]
  27. --2022-08-05 14:33:48--  https://matt.ucc.asn.au/dropbear/releases/dropbear-2019.78.tar.bz2
  28. 再次使用存在的到 matt.ucc.asn.au:443 的连接。
  29. 已发出 HTTP 请求,正在等待回应... 302 Found
  30. 位置:https://matt.ucc.asn.au/dropbear/releases/dropbear-2019.78.tar.bz2 [跟随至新的 URL]
  31. --2022-08-05 14:33:49--  https://matt.ucc.asn.au/dropbear/releases/dropbear-2019.78.tar.bz2
  32. 再次使用存在的到 matt.ucc.asn.au:443 的连接。
  33. 已发出 HTTP 请求,正在等待回应... 302 Found
  34. 位置:https://matt.ucc.asn.au/dropbear/releases/dropbear-2019.78.tar.bz2 [跟随至新的 URL]
  35. --2022-08-05 14:33:49--  https://matt.ucc.asn.au/dropbear/releases/dropbear-2019.78.tar.bz2
  36. 再次使用存在的到 matt.ucc.asn.au:443 的连接。
  37. 已发出 HTTP 请求,正在等待回应... 302 Found
  38. 位置:https://matt.ucc.asn.au/dropbear/releases/dropbear-2019.78.tar.bz2 [跟随至新的 URL]
  39. --2022-08-05 14:33:50--  https://matt.ucc.asn.au/dropbear/releases/dropbear-2019.78.tar.bz2
  40. 再次使用存在的到 matt.ucc.asn.au:443 的连接。
  41. 已发出 HTTP 请求,正在等待回应... 302 Found
  42. 位置:https://matt.ucc.asn.au/dropbear/releases/dropbear-2019.78.tar.bz2 [跟随至新的 URL]
  43. --2022-08-05 14:33:50--  https://matt.ucc.asn.au/dropbear/releases/dropbear-2019.78.tar.bz2
  44. 再次使用存在的到 matt.ucc.asn.au:443 的连接。
  45. 已发出 HTTP 请求,正在等待回应... 302 Found
  46. 位置:https://matt.ucc.asn.au/dropbear/releases/dropbear-2019.78.tar.bz2 [跟随至新的 URL]
  47. --2022-08-05 14:33:51--  https://matt.ucc.asn.au/dropbear/releases/dropbear-2019.78.tar.bz2
  48. 再次使用存在的到 matt.ucc.asn.au:443 的连接。
  49. 已发出 HTTP 请求,正在等待回应... 302 Found
  50. 位置:https://matt.ucc.asn.au/dropbear/releases/dropbear-2019.78.tar.bz2 [跟随至新的 URL]
  51. --2022-08-05 14:33:52--  https://matt.ucc.asn.au/dropbear/releases/dropbear-2019.78.tar.bz2
  52. 再次使用存在的到 matt.ucc.asn.au:443 的连接。
  53. 已发出 HTTP 请求,正在等待回应... 302 Found
  54. 位置:https://matt.ucc.asn.au/dropbear/releases/dropbear-2019.78.tar.bz2 [跟随至新的 URL]
  55. --2022-08-05 14:33:52--  https://matt.ucc.asn.au/dropbear/releases/dropbear-2019.78.tar.bz2
  56. 再次使用存在的到 matt.ucc.asn.au:443 的连接。
  57. 已发出 HTTP 请求,正在等待回应... 302 Found
  58. 位置:https://matt.ucc.asn.au/dropbear/releases/dropbear-2019.78.tar.bz2 [跟随至新的 URL]
  59. --2022-08-05 14:33:53--  https://matt.ucc.asn.au/dropbear/releases/dropbear-2019.78.tar.bz2
  60. 再次使用存在的到 matt.ucc.asn.au:443 的连接。
  61. 已发出 HTTP 请求,正在等待回应... 302 Found
  62. 位置:https://matt.ucc.asn.au/dropbear/releases/dropbear-2019.78.tar.bz2 [跟随至新的 URL]
  63. --2022-08-05 14:33:53--  https://matt.ucc.asn.au/dropbear/releases/dropbear-2019.78.tar.bz2
  64. 再次使用存在的到 matt.ucc.asn.au:443 的连接。
  65. 已发出 HTTP 请求,正在等待回应... 302 Found
  66. 位置:https://matt.ucc.asn.au/dropbear/releases/dropbear-2019.78.tar.bz2 [跟随至新的 URL]
  67. --2022-08-05 14:33:54--  https://matt.ucc.asn.au/dropbear/releases/dropbear-2019.78.tar.bz2
  68. 再次使用存在的到 matt.ucc.asn.au:443 的连接。
  69. 已发出 HTTP 请求,正在等待回应... 302 Found
  70. 位置:https://matt.ucc.asn.au/dropbear/releases/dropbear-2019.78.tar.bz2 [跟随至新的 URL]
  71. --2022-08-05 14:33:55--  https://matt.ucc.asn.au/dropbear/releases/dropbear-2019.78.tar.bz2
  72. 再次使用存在的到 matt.ucc.asn.au:443 的连接。
  73. 已发出 HTTP 请求,正在等待回应... 302 Found
  74. 位置:https://matt.ucc.asn.au/dropbear/releases/dropbear-2019.78.tar.bz2 [跟随至新的 URL]
  75. --2022-08-05 14:33:55--  https://matt.ucc.asn.au/dropbear/releases/dropbear-2019.78.tar.bz2
  76. 再次使用存在的到 matt.ucc.asn.au:443 的连接。
  77. 已发出 HTTP 请求,正在等待回应... 302 Found
  78. 位置:https://matt.ucc.asn.au/dropbear/releases/dropbear-2019.78.tar.bz2 [跟随至新的 URL]
  79. --2022-08-05 14:33:56--  https://matt.ucc.asn.au/dropbear/releases/dropbear-2019.78.tar.bz2
  80. 再次使用存在的到 matt.ucc.asn.au:443 的连接。
  81. 已发出 HTTP 请求,正在等待回应... 302 Found
  82. 位置:https://matt.ucc.asn.au/dropbear/releases/dropbear-2019.78.tar.bz2 [跟随至新的 URL]
  83. --2022-08-05 14:33:57--  https://matt.ucc.asn.au/dropbear/releases/dropbear-2019.78.tar.bz2
  84. 再次使用存在的到 matt.ucc.asn.au:443 的连接。
  85. 已发出 HTTP 请求,正在等待回应... 302 Found
  86. 位置:https://matt.ucc.asn.au/dropbear/releases/dropbear-2019.78.tar.bz2 [跟随至新的 URL]
  87. 已超过 20 次重定向。
  88. --2022-08-05 14:33:57--  http://sources.buildroot.net/dropbear-2019.78.tar.bz2
  89. 正在解析主机 sources.buildroot.net (sources.buildroot.net)... 104.26.0.37, 172.67.72.56, 104.26.1.37, ...
  90. 正在连接 sources.buildroot.net (sources.buildroot.net)|104.26.0.37|:80... 已连接。
  91. 已发出 HTTP 请求,正在等待回应... 404 Not Found
  92. 2022-08-05 14:33:58 错误 404:Not Found。

  93. package/pkg-generic.mk:138: recipe for target '/home/evler/tinker_board_2/buildroot/output/build/dropbear-2019.78/.stamp_downloaded' failed
  94. make[1]: *** [/home/evler/tinker_board_2/buildroot/output/build/dropbear-2019.78/.stamp_downloaded] Error 1
  95. Makefile:83: recipe for target '_all' failed
  96. make: *** [_all] Error 2
复制代码


回复

使用道具 举报

1

主题

3

帖子

11

积分

新手上路

Rank: 1

积分
11
 楼主| 发表于 2022-8-5 15:14:05 | 显示全部楼层
去谷歌上面找到另一个链接:http://sources.buildroot.net/dropbear/dropbear-2019.78.tar.bz2
下载好后放置dl目录即可,又可以愉快的进行make了
  1. cd dl/
  2. wget http://sources.buildroot.net/dropbear/dropbear-2019.78.tar.bz2
  3. cd ../
  4. make
复制代码


回复 支持 反对

使用道具 举报

1

主题

3

帖子

11

积分

新手上路

Rank: 1

积分
11
 楼主| 发表于 2022-8-5 18:41:05 | 显示全部楼层
本帖最后由 风火轮用户mo1Q5 于 2022-8-5 19:04 编辑

出现了新的错误。。。。
使用 https://github.com/TinkerBoard2/kernel 内核 linux4.4-rk3399 分支
  1. >>> linux-tools  Building
  2. PATH="/home/evler/tinker_board_2/buildroot/output/host/bin:/home/evler/tinker_board_2/buildroot/output/host/sbin:/home/evler/git-repo:/usr/local/sbin:/usr/local/bin:/usr/sbin:/usr/bin:/sbin:/bin:/usr/games:/usr/local/games:/snap/bin:/usr/local/arm/gcc-arm-9.2-2019.12-x86_64-arm-none-linux-gnueabihf/bin" /usr/bin/make -j1 HOSTCC="/usr/bin/gcc -O2 -I/home/evler/tinker_board_2/buildroot/output/host/include -L/home/evler/tinker_board_2/buildroot/output/host/lib -Wl,-rpath,/home/evler/tinker_board_2/buildroot/output/host/lib" ARCH=arm64 INSTALL_MOD_PATH=/home/evler/tinker_board_2/buildroot/output/target CROSS_COMPILE="/home/evler/tinker_board_2/buildroot/output/host/bin/aarch64-buildroot-linux-gnu-" DEPMOD=/home/evler/tinker_board_2/buildroot/output/host/sbin/depmod INSTALL_MOD_STRIP=1 JOBS=5 ARCH=arm64 DESTDIR=/home/evler/tinker_board_2/buildroot/output/target prefix=/usr WERROR=0 NO_LIBAUDIT=1 NO_NEWT=1 NO_GTK2=1 NO_LIBPERL=1 NO_LIBPYTHON=1 NO_LIBBIONIC=1 NO_SLANG=1 NO_LIBUNWIND=1 NO_LIBNUMA=1 NO_LIBELF=1 NO_DWARF=1 NO_LZMA=1 -C /home/evler/tinker_board_2/buildroot/output/build/linux-custom/tools/perf O=/home/evler/tinker_board_2/buildroot/output/build/linux-custom/tools/perf/
  3.   BUILD:   Doing 'make -j5' parallel build

  4. Auto-detecting system features:
  5. ...                         dwarf: [ OFF ]
  6. ...                         glibc: [ on  ]
  7. ...                          gtk2: [ OFF ]
  8. ...                      libaudit: [ OFF ]
  9. ...                        libbfd: [ OFF ]
  10. ...                        libelf: [ OFF ]
  11. ...                       libnuma: [ OFF ]
  12. ...        numa_num_possible_cpus: [ OFF ]
  13. ...                       libperl: [ OFF ]
  14. ...                     libpython: [ OFF ]
  15. ...                      libslang: [ OFF ]
  16. ...                     libunwind: [ OFF ]
  17. ...            libdw-dwarf-unwind: [ OFF ]
  18. ...                          zlib: [ on  ]
  19. ...                          lzma: [ OFF ]
  20. ...                     get_cpuid: [ OFF ]
  21. ...                           bpf: [ on  ]

  22. config/Makefile:351: Disabling post unwind, no support found.
  23. config/Makefile:489: Python support disabled by user
  24.   GEN      /home/evler/tinker_board_2/buildroot/output/build/linux-custom/tools/perf/common-cmds.h
  25.   CC       /home/evler/tinker_board_2/buildroot/output/build/linux-custom/tools/perf/util/abspath.o
  26.   MKDIR    /home/evler/tinker_board_2/buildroot/output/build/linux-custom/tools/perf/fd/
  27.   CC       /home/evler/tinker_board_2/buildroot/output/build/linux-custom/tools/perf/fd/array.o
  28.   CC       /home/evler/tinker_board_2/buildroot/output/build/linux-custom/tools/perf/event-parse.o
  29.   CC       /home/evler/tinker_board_2/buildroot/output/build/linux-custom/tools/perf/event-plugin.o
  30.   LD       /home/evler/tinker_board_2/buildroot/output/build/linux-custom/tools/perf/fd/libapi-in.o
  31.   MKDIR    /home/evler/tinker_board_2/buildroot/output/build/linux-custom/tools/perf/fs/
  32.   CC       /home/evler/tinker_board_2/buildroot/output/build/linux-custom/tools/perf/fs/fs.o
  33.   CC       /home/evler/tinker_board_2/buildroot/output/build/linux-custom/tools/perf/util/alias.o
  34.   CC       /home/evler/tinker_board_2/buildroot/output/build/linux-custom/tools/perf/util/annotate.o
  35. In file included from /home/evler/tinker_board_2/buildroot/output/host/aarch64-buildroot-linux-gnu/sysroot/usr/include/string.h:494,
  36.                  from fs/fs.c:7:
  37. 在函数‘strncpy’中,
  38.     内联自‘fs__env_override’于 fs/fs.c:191:2,
  39.     内联自‘fs__get_mountpoint’于 fs/fs.c:197:6:
  40. /home/evler/tinker_board_2/buildroot/output/host/aarch64-buildroot-linux-gnu/sysroot/usr/include/bits/string_fortified.h:106:10: 错误:‘__builtin_strncpy’ specified bound 4096 equals destination size [-Werror=stringop-truncation]
  41.   106 |   return __builtin___strncpy_chk (__dest, __src, __len, __bos (__dest));
  42.       |          ^~~~~~~~~~~~~~~~~~~~~~~~~~~~~~~~~~~~~~~~~~~~~~~~~~~~~~~~~~~~~~
  43. In file included from /home/evler/tinker_board_2/buildroot/output/build/linux-custom/tools/include/linux/list.h:5,
  44.                  from util/sort.h:8,
  45.                  from util/annotate.c:12:
  46. /home/evler/tinker_board_2/buildroot/output/build/linux-custom/tools/include/linux/../../../include/linux/list.h: 在函数‘__list_add_valid’中:
  47. /home/evler/tinker_board_2/buildroot/output/build/linux-custom/tools/include/linux/../../../include/linux/list.h:37:55: 警告:unused parameter ‘new’ [-Wunused-parameter]
  48.    37 | static inline bool __list_add_valid(struct list_head *new,
  49.       |                                     ~~~~~~~~~~~~~~~~~~^~~
  50. /home/evler/tinker_board_2/buildroot/output/build/linux-custom/tools/include/linux/../../../include/linux/list.h:38:23: 警告:unused parameter ‘prev’ [-Wunused-parameter]
  51.    38 |     struct list_head *prev,
  52.       |     ~~~~~~~~~~~~~~~~~~^~~~
  53. /home/evler/tinker_board_2/buildroot/output/build/linux-custom/tools/include/linux/../../../include/linux/list.h:39:23: 警告:unused parameter ‘next’ [-Wunused-parameter]
  54.    39 |     struct list_head *next)
  55.       |     ~~~~~~~~~~~~~~~~~~^~~~
  56. /home/evler/tinker_board_2/buildroot/output/build/linux-custom/tools/include/linux/../../../include/linux/list.h: 在函数‘__list_del_entry_valid’中:
  57. /home/evler/tinker_board_2/buildroot/output/build/linux-custom/tools/include/linux/../../../include/linux/list.h:43:61: 警告:unused parameter ‘entry’ [-Wunused-parameter]
  58.    43 | static inline bool __list_del_entry_valid(struct list_head *entry)
  59.       |                                           ~~~~~~~~~~~~~~~~~~^~~~~
  60. cc1:所有的警告都被当作是错误
  61.   MKDIR    /home/evler/tinker_board_2/buildroot/output/build/linux-custom/tools/perf/fs/
  62.   CC       /home/evler/tinker_board_2/buildroot/output/build/linux-custom/tools/perf/fs/tracing_path.o
  63.   CC       /home/evler/tinker_board_2/buildroot/output/build/linux-custom/tools/perf/arch/common.o
  64. In file included from /home/evler/tinker_board_2/buildroot/output/build/linux-custom/tools/include/linux/list.h:5,
  65.                  from arch/../util/map.h:6,
  66.                  from arch/../util/event.h:8,
  67.                  from arch/../util/debug.h:7,
  68.                  from arch/common.c:4:
  69. /home/evler/tinker_board_2/buildroot/output/build/linux-custom/tools/include/linux/../../../include/linux/list.h: 在函数‘__list_add_valid’中:
  70. /home/evler/tinker_board_2/buildroot/output/build/linux-custom/tools/include/linux/../../../include/linux/list.h:37:55: 警告:unused parameter ‘new’ [-Wunused-parameter]
  71.    37 | static inline bool __list_add_valid(struct list_head *new,
  72.       |                                     ~~~~~~~~~~~~~~~~~~^~~
  73. /home/evler/tinker_board_2/buildroot/output/build/linux-custom/tools/include/linux/../../../include/linux/list.h:38:23: 警告:unused parameter ‘prev’ [-Wunused-parameter]
  74.    38 |     struct list_head *prev,
  75.       |     ~~~~~~~~~~~~~~~~~~^~~~
  76. /home/evler/tinker_board_2/buildroot/output/build/linux-custom/tools/include/linux/../../../include/linux/list.h:39:23: 警告:unused parameter ‘next’ [-Wunused-parameter]
  77.    39 |     struct list_head *next)
  78.       |     ~~~~~~~~~~~~~~~~~~^~~~
  79. /home/evler/tinker_board_2/buildroot/output/build/linux-custom/tools/include/linux/../../../include/linux/list.h: 在函数‘__list_del_entry_valid’中:
  80. /home/evler/tinker_board_2/buildroot/output/build/linux-custom/tools/include/linux/../../../include/linux/list.h:43:61: 警告:unused parameter ‘entry’ [-Wunused-parameter]
  81.    43 | static inline bool __list_del_entry_valid(struct list_head *entry)
  82.       |                                           ~~~~~~~~~~~~~~~~~~^~~~~
  83.   LD       /home/evler/tinker_board_2/buildroot/output/build/linux-custom/tools/perf/fs/libapi-in.o
  84. /home/evler/tinker_board_2/buildroot/output/host/bin/aarch64-buildroot-linux-gnu-ld: 找不到 /home/evler/tinker_board_2/buildroot/output/build/linux-custom/tools/perf/fs/fs.o: 没有那个文件或目录
  85. /home/evler/tinker_board_2/buildroot/output/build/linux-custom/tools/build/Makefile.build:131: recipe for target '/home/evler/tinker_board_2/buildroot/output/build/linux-custom/tools/perf/fs/libapi-in.o' failed
  86. make[6]: *** [/home/evler/tinker_board_2/buildroot/output/build/linux-custom/tools/perf/fs/libapi-in.o] Error 1
  87. /home/evler/tinker_board_2/buildroot/output/build/linux-custom/tools/build/Makefile.build:126: recipe for target 'fs' failed
  88. make[5]: *** [fs] Error 2
  89. Makefile:34: recipe for target '/home/evler/tinker_board_2/buildroot/output/build/linux-custom/tools/perf/libapi-in.o' failed
  90. make[4]: *** [/home/evler/tinker_board_2/buildroot/output/build/linux-custom/tools/perf/libapi-in.o] Error 2
  91. Makefile.perf:445: recipe for target '/home/evler/tinker_board_2/buildroot/output/build/linux-custom/tools/perf/libapi.a' failed
  92. make[3]: *** [/home/evler/tinker_board_2/buildroot/output/build/linux-custom/tools/perf/libapi.a] Error 2
  93. make[3]: *** 正在等待未完成的任务....
复制代码

回复 支持 反对

使用道具 举报

您需要登录后才可以回帖 登录 | 立即注册

本版积分规则

QQ|风火轮WIKI|手机版|深圳风火轮团队 ( 粤ICP备17095099号 )

GMT+8, 2022-9-27 03:03 , Processed in 0.045833 second(s), 19 queries .

快速回复 返回顶部 返回列表
 
【客服1】 商务合作 15289193
【客服2】 业务洽谈 13257599
【客服3】 售前咨询 510313198
【邮箱】
smartfire@smartfire.cn